{"text_format":"1","workbook":"xlsx","n_sheets":9,"sheets":["LookUp Tables","Instructions","Basic Price Adjustment","Data","Order Details","Vendor Totals","Order Summary","PJ-101","FIELD"],"not_rendered":{"charts":0,"images":0,"macros":1,"external_links":3,"defined_names":95,"comments":4,"pivot_tables":0},"unopened":[],"bounds":{"document_bytes":16777216,"sheet_cells":100000,"rows_first":2000,"rows_last":500,"rows_between":2000,"halvings":0,"cell_chars":16384,"cell_head_chars":4096},"cells_cut":0,"cells_raw":0,"read":"whole","date_system":"1900"}

{"sheet":"LookUp Tables","index":0,"n_rows":61,"n_cols":23,"rows_kept":61,"cut":false,"hidden":true,"merged":[[6,0,6,1],[14,0,14,1],[21,0,21,1],[27,0,27,1]]}
[]
["Override",null,null,"Activity",null,null,null,"County","Number","District",null,"Supplemental Code",null,null,"District",null,"Other Override",null,"Project Description",null,null,"Vendor","Oasis ID"]
[0,"NO",null,"A1","Section 401 Base I",1,null,"Barbour",1,7,null,"00","Not Applicable",null,1,null,"Yes",null,"Preservation",null,null,"AAA PAVING AND SEALING INC","DOT20*41"]
[1,"YES",null,"A2","Section 401 25mm Superpave",2,null,"Berkeley",2,"05",null,"01","Alternate",null,2,null,"No",null,"Minor Rehabilitation",null,null,"BELT PAVING INC","DOT20*40"]
[null,null,null,"A3","Section 401 Base II",3,null,"Boone",3,"01",null,"02","Wye",null,3,null,null,null,"Major Rehabilitation",null,null,"CAMDEN MATERIALS LLC","DOT20*42"]
[null,null,null,"A4","Section 401 Patch & Level",4,null,"Braxton",4,"07",null,"03","Spur",null,4,null,"Other Override",null,"Reconstruction",null,null,"CAST & BAKER CORP","DOT20*43"]
["Sign System",null,null,"A5","Section 401 Wearing IV",5,null,"Brooke",5,"06",null,"04","North",null,5,null,1,null,null,null,null,"C WILLIAM HETZER INC","DOT20*44"]
["I",1,null,"A6","Section 402 Wearing IV",6,null,"Cabell",6,"02",null,"05","South",null,6,null,0,null,null,null,null,"GREENBRIER EXCAVATING & PAVING","DOT20*45"]
{"$rows_left_out":54}
{"sheet":"Instructions","index":1,"n_rows":19,"n_cols":1,"rows_kept":19,"cut":false,"hidden":false,"merged":[]}
["Instructions"]
["1. Go to 'Order Details' sheet\n(Note: all dark green boxes indicate a user input area, all cells containing a note have red indicators in top right corner, scroll over to display note)\n(Note: some cells contain drop down lists for selections, choose a selection from the list, do not type in entry)"]
["2. Select a county from the drop down menu"]
["3. Select the \"Get Bidders\" button"]
["4. Select the \"Clear Data\" button to clear any existing, old data in the sheet"]
["5. Enter the route information into the Route box"]
["6. Enter the beginning mile post (BMP), end mile post (EMP), longitude, latitude, and a beginning and end item description "]
["7. Enter the length, average width, average thickness, and total number of lanes"]
{"$rows_left_out":12}
{"sheet":"Basic Price Adjustment","index":2,"n_rows":55,"n_cols":6,"rows_kept":55,"cut":false,"hidden":false,"merged":[]}
["2024 Hot Mix Asphalt Contract (Material and Pickup by WVDOH Forces Only)"]
["Unit Bid Price Adjustment"]
[" ",null,"Asphalt","Fuel"]
["Asphalt Price Index at Month of Bid Opening October 2023, Ib","Fuel Price Index at Month of Bid Opening October 2023, Ib",605,3.3066]
[{"$f":"'[3]Basic Price Adjustment'!$A5","v":"(Enter Month of Record) 2024 Price Index, Ip"},{"$f":"A5","v":"(Enter Month of Record) 2024 Price Index, Ip"},{"$f":"'[3]Basic Price Adjustment'!$C5","v":0},{"$f":"'[3]Basic Price Adjustment'!$D5","v":0},null,"Monthly Fuel/Asphalt Price Link"]
[null,null,null," "]
[" ",null," "]
["Asphalt Cement Content, AC",null," "]
{"$rows_left_out":48}
{"sheet":"Data","index":3,"n_rows":201,"n_cols":31,"rows_kept":201,"cut":false,"hidden":true,"merged":[[1,0,1,3],[147,14,147,15],[247,7,247,8]]}
[0,1,2,3,4,5,6,7,8,9,10,11,12,13,14,15,16,17,18,19,20,21,22,23,24,25,26,27,28,29,30]
["MASTER BID TABLE (Material)"]
["District","PID","Vendor","Location","Plant Location","City","State",1,2,3,4,5,6,7,8,9,10,11,12,13,14,15,16,17,18,19,20,21,22,23,24]
[1,101,"AMERICAN ASPHALT","2334 Rt 52, Kenova, WV 25530","KENOVA","Kenova","WV",73.989999999999995,74.989999999999995,76.95,76.95,77.680000000000007,84.41,77.25,84.56,89.03,84.56,88.83,110,110,105,110,89.11,89.11,84.56,5,12.5,0,0,3500,1000]
[1,102,"AMERICAN ASPHALT","484 Industrial Rd, St Albans, WV 25177","ST ALBANS","St Albans","WV",74.510000000000005,75.510000000000005,77.540000000000006,77.540000000000006,78.59,85.91,79.19,85.39,89.89,85.39,89.25,110,110,105,110,89.11,89.11,85.39,5,12.5,0,0,3500,1000]
[1,103,"GREENBRIER EXCAVATING","232 Rambler Rd, Lewisburg, WV 24901","LEWISBURG","Lewisburg","WV",62.32,0,72.87,72.87,73.61,0,0,76.180000000000007,0,75.92,84.55,0,0,0,0,0,0,75.92,0,0,0,0,3000,750]
[1,104,"JF ALLEN","320 Alcon Rd, Buckhannon, WV 26201","BUCKHANNON","Buckhannon","WV",68.95,72.88,73.2,73.2,73.41,77.09,73.2,78.08,82.92,78.08,83.06,97.95,100.45,94.46,97.68,83.71,86.38,77.739999999999995,4.75,12.5,10,10,3500,1500]
[1,105,"JF ALLEN","3105 Harrison Ave., Elkins WV 26257","ELKINS","Elkins","WV",63.28,62.87,68.45,68.45,69.510000000000005,72.37,68.45,77.23,77.97,75.37,77.97,86,87.6,87.63,91.28,77.510000000000005,80.84,77.08,4.75,12.5,10,10,3500,1500]
{"$rows_left_out":194}
{"sheet":"Order Details","index":4,"n_rows":30,"n_cols":15,"rows_kept":30,"cut":false,"hidden":false,"merged":[]}
["HOT-LAID BITUMINOUS CONCRETE PROJECT COST"]
[null,"County",null,"District",null,null,null,null,"Estimated Asphalt Quantities",null,"Unit(s)"]
[null,"Berkeley",null,{"$f":"VLOOKUP(B3,County,3,FALSE)","v":"05"},null,null,null,null,"HMA Required for Pavement",{"$f":"E24*B26*110/2000","v":0},"TONS"]
[null,null,null,null,null,null,null,null,"HMA Required for Shoulders",{"$f":"E28*B30*110/2000","v":0},"TONS"]
[]
["Sign",null,null,"BMP",null,null,null,"Item","Description","Quantity","Unit(s)"]
["Route",null,null,"EMP",null,null,null,1,"Asphalt Section 401 - Base I",1,"Ton",null,"Potential Vendors"]
["Subroute",null,null,null,null,null,null,2,"Asphalt Section 401 - 25mm Superpave",null,"Ton",null,"PID","Vendor","Plant Location"]
{"$rows_left_out":23}
{"sheet":"Vendor Totals","index":5,"n_rows":32,"n_cols":81,"rows_kept":32,"cut":false,"hidden":false,"merged":[[1,73,1,74],[1,37,1,38],[1,41,1,42],[1,45,1,46],[1,49,1,50],[1,53,1,54],[1,57,1,58],[1,61,1,62],[1,65,1,66],[1,69,1,70],[1,21,1,22],[1,25,1,26],[1,29,1,30],[1,33,1,34],[0,1,1,1],[1,5,1,6],[1,9,1,10],[1,13,1,14],[1,17,1,18]]}
[null,"Lowest\nBid",{"$f":"SMALL(CB8:CB25,COUNTIF(CB8:CB25,0)+1)","v":31.479999999999997}]
[null,null,{"$f":"VLOOKUP(B3,'Order Details'!_xlnm.Extract,2,0)","v":"C WILLIAM HETZER INC"},null,null,"Vendor A",null,null,null,"Vendor B",null,null,null,"Vendor C",null,null,null,"Vendor D",null,null,null,"Vendor E",null,null,null,"Vendor F",null,null,null,"Vendor G",null,null,null,"Vendor H",null,null,null,"Vendor I",null,null,null,"Vendor J",null,null,null,"Vendor K",null,null,null,"Vendor L",null,null,null,"Vendor M",null,null,null,"Vendor N",null,null,null,"Vendor O",null,null,null,"Vendor P",null,null,null,"Vendor Q",null,null,null,"Vendor R"]
[null,{"$f":"VLOOKUP(C1,CB8:CC25,2,0)","v":513},{"$f":"VLOOKUP(B3,'Order Details'!_xlnm.Extract,3,0)","v":"10104 Mapleville Road\nHagerstown, MD 21740"},null,null,{"$f":"H3","v":501},null,{"$f":"'Order Details'!$M9","v":501},null,{"$f":"L3","v":502},null,{"$f":"'Order Details'!$M10","v":502},null,{"$f":"P3","v":503},null,{"$f":"'Order Details'!$M11","v":503},null,{"$f":"T3","v":504},null,{"$f":"'Order Details'!$M12","v":504},null,{"$f":"X3","v":505},null,{"$f":"'Order Details'!$M13","v":505},null,{"$f":"AB3","v":506},null,{"$f":"'Order Details'!$M14","v":506},null,{"$f":"AF3","v":507},null,{"$f":"'Order Details'!$M15","v":507},null,{"$f":"AJ3","v":508},null,{"$f":"'Order Details'!$M16","v":508},null,{"$f":"AN3","v":509},null,{"$f":"'Order Details'!$M17","v":509},null,{"$f":"AR3","v":510},null,{"$f":"'Order Details'!$M18","v":510},null,{"$f":"AV3","v":511},null,{"$f":"'Order Details'!$M19","v":511},null,{"$f":"AZ3","v":512},null,{"$f":"'Order Details'!$M20","v":512},null,{"$f":"BD3","v":513},null,{"$f":"'Order Details'!$M21","v":513},null,{"$f":"BH3","v":514},null,{"$f":"'Order Details'!$M22","v":514},null,{"$f":"BL3","v":515},null,{"$f":"'Order Details'!$M23","v":515},null,{"$f":"BP3","v":516},null,{"$f":"'Order Details'!$M24","v":516},null,{"$f":"BT3","v":0},null,{"$f":"'Order Details'!$M25","v":0},null,{"$f":"BX3","v":0},null,{"$f":"'Order Details'!$M26","v":0}]
[null,null,null,null,null,{"$f":"'Order Details'!$N9","v":"BELT PAVING"},null,null,null,{"$f":"'Order Details'!$N10","v":"GREENBRIER EXCAVATING"},null,null,null,{"$f":"'Order Details'!$N11","v":"WL CONTRUCTION"},null,null,null,{"$f":"'Order Details'!$N12","v":"WL CONTRUCTION"},null,null,null,{"$f":"'Order Details'!$N13","v":"WL CONTRUCTION"},null,null,null,{"$f":"'Order Details'!$N14","v":"WL CONTRUCTION"},null,null,null,{"$f":"'Order Details'!$N15","v":"JF ALLEN"},null,null,null,{"$f":"'Order Details'!$N16","v":"JF ALLEN"},null,null,null,{"$f":"'Order Details'!$N17","v":"JF ALLEN"},null,null,null,{"$f":"'Order Details'!$N18","v":"P&W Excavating"},null,null,null,{"$f":"'Order Details'!$N19","v":"STUART M PERRY"},null,null,null,{"$f":"'Order Details'!$N20","v":"KELLY PAVING "},null,null,null,{"$f":"'Order Details'!$N21","v":"C WILLIAM HETZER INC"},null,null,null,{"$f":"'Order Details'!$N22","v":"NEW ENTERPRISE"},null,null,null,{"$f":"'Order Details'!$N23","v":"NEW ENTERPRISE"},null,null,null,{"$f":"'Order Details'!$N24","v":"WV PAVING"},null,null,null,{"$f":"'Order Details'!$N25","v":0},null,null,null,{"$f":"'Order Details'!$N26","v":0}]
[null,null,null,null,null,{"$f":"'Order Details'!$O9","v":"11269 Waxler Rd, Keyser WV 26726"},null,null,null,{"$f":"'Order Details'!$O10","v":"232 Rambler Rd, Lewisburg, WV 24901"},null,null,null,{"$f":"'Order Details'!$O11","v":"390 Pedal Car Drive, Inwood, WV 25428"},null,null,null,{"$f":"'Order Details'!$O12","v":"57 Blair Rd, Harpers Ferry WV 25425"},null,null,null,{"$f":"'Order Details'!$O13","v":"866 Oranda Rd., Strasburg VA 22657"},null,null,null,{"$f":"'Order Details'!$O14","v":"660 Quarry Lane Clearbrook VA 22624"},null,null,null,{"$f":"'Order Details'!$O15","v":"3105 Harrison Ave., Elkins WV 26257"},null,null,null,{"$f":"'Order Details'!$O16","v":"320 Alcon Rd, Buckhannon, WV 26201"},null,null,null,{"$f":"'Order Details'!$O17","v":"5856 Saltwell Rd, Bridgeport, WV 26330"},null,null,null,{"$f":"'Order Details'!$O18","v":"Warfordsburg, PA 17267"},null,null,null,{"$f":"'Order Details'!$O19","v":"117 Limestone Lane, Winchester, VA 22602"},null,null,null,{"$f":"'Order Details'!$O20","v":"123 Dodd Drive, St. Marys WV 26170"},null,null,null,{"$f":"'Order Details'!$O21","v":"10104 Mapleville Road\nHagerstown, MD 21740"},null,null,null,{"$f":"'Order Details'!$O22","v":"3587 Stone Quarry Rd Chamersburg PA 17201"},null,null,null,{"$f":"'Order Details'!$O23","v":"526 Ashcom Rd Everett  PA 15537"},null,null,null,{"$f":"'Order Details'!$O24","v":"Greenland Gap Rd, Scherr, WV 26726"},null,null,null,{"$f":"'Order Details'!$O25","v":0},null,null,null,{"$f":"'Order Details'!$O26","v":0}]
[null,null,null,null,null,"PROJECT TOTAL",null,{"$f":"IFERROR(IF(I32=\"Incomplete\",\"Incomplete\",SUM(H8:H31)),\"\")","v":40.479999999999997},null,"PROJECT TOTAL",null,{"$f":"IFERROR(IF(M32=\"Incomplete\",\"Incomplete\",SUM(L8:L31)),\"\")","v":37.299999999999997},null,"PROJECT TOTAL",null,{"$f":"IFERROR(IF(Q32=\"Incomplete\",\"Incomplete\",SUM(P8:P31)),\"\")","v":38.479999999999997},null,"PROJECT TOTAL",null,{"$f":"IFERROR(IF(U32=\"Incomplete\",\"Incomplete\",SUM(T8:T31)),\"\")","v":41.18},null,"PROJECT TOTAL",null,{"$f":"IFERROR(IF(Y32=\"Incomplete\",\"Incomplete\",SUM(X8:X31)),\"\")","v":38.479999999999997},null,"PROJECT TOTAL",null,{"$f":"IFERROR(IF(AC32=\"Incomplete\",\"Incomplete\",SUM(AB8:AB31)),\"\")","v":38.479999999999997},null,"PROJECT TOTAL",null,{"$f":"IFERROR(IF(AG32=\"Incomplete\",\"Incomplete\",SUM(AF8:AF31)),\"\")","v":38.26},null,"PROJECT TOTAL",null,{"$f":"IFERROR(IF(AK32=\"Incomplete\",\"Incomplete\",SUM(AJ8:AJ31)),\"\")","v":43.93},null,"PROJECT TOTAL",null,{"$f":"IFERROR(IF(AO32=\"Incomplete\",\"Incomplete\",SUM(AN8:AN31)),\"\")","v":44.62},null,"PROJECT TOTAL",null,{"$f":"IFERROR(IF(AS32=\"Incomplete\",\"Incomplete\",SUM(AR8:AR31)),\"\")","v":44.48},null,"PROJECT TOTAL",null,{"$f":"IFERROR(IF(AW32=\"Incomplete\",\"Incomplete\",SUM(AV8:AV31)),\"\")","v":"Incomplete"},null,"PROJECT TOTAL",null,{"$f":"IFERROR(IF(BA32=\"Incomplete\",\"Incomplete\",SUM(AZ8:AZ31)),\"\")","v":54.98},null,"PROJECT TOTAL",null,{"$f":"IFERROR(IF(BE32=\"Incomplete\",\"Incomplete\",SUM(BD8:BD31)),\"\")","v":31.479999999999997},null,"PROJECT TOTAL",null,{"$f":"IFERROR(IF(BI32=\"Incomplete\",\"Incomplete\",SUM(BH8:BH31)),\"\")","v":44.98},null,"PROJECT TOTAL",null,{"$f":"IFERROR(IF(BM32=\"Incomplete\",\"Incomplete\",SUM(BL8:BL31)),\"\")","v":44.98},null,"PROJECT TOTAL",null,{"$f":"IFERROR(IF(BQ32=\"Incomplete\",\"Incomplete\",SUM(BP8:BP31)),\"\")","v":46.48},null,"PROJECT TOTAL",null,{"$f":"IFERROR(IF(BU32=\"Incomplete\",\"Incomplete\",SUM(BT8:BT31)),\"\")","v":0},null,"PROJECT TOTAL",null,{"$f":"IFERROR(IF(BY32=\"Incomplete\",\"Incomplete\",SUM(BX8:BX31)),\"\")","v":0}]
[null,"Item","Description    ",null,"Quantity","Unit $","Unit $ with Qty","Adjusted",null,"Unit $","Unit $ with Qty","Adjusted",null,"Unit $","Unit $ with Qty","Adjusted",null,"Unit $","Unit $ with Qty","Adjusted",null,"Unit $","Unit $ with Qty","Adjusted",null,"Unit $","Unit $ with Qty","Adjusted",null,"Unit $","Unit $ with Qty","Adjusted",null,"Unit $","Unit $ with Qty","Adjusted",null,"Unit $","Unit $ with Qty","Adjusted",null,"Unit $","Unit $ with Qty","Adjusted",null,"Unit $","Unit $ with Qty","Adjusted",null,"Unit $","Unit $ with Qty","Adjusted",null,"Unit $","Unit $ with Qty","Adjusted",null,"Unit $","Unit $ with Qty","Adjusted",null,"Unit $","Unit $ with Qty","Adjusted",null,"Unit $","Unit $ with Qty","Adjusted",null,"Unit $","Unit $ with Qty","Adjusted",null,"Unit $","Unit $ with Qty","Adjusted"]
[null,1,"Asphalt Section 401 - Base I",null,{"$f":"'Order Details'!J7","v":1},{"$f":"IFERROR(VLOOKUP(H$3,Data!$B$4:$AE$137,7,0),\"\")","v":65.5},{"$f":"IFERROR(F8*$E8,\"\")","v":65.5},{"$f":"IF(G8=0,0,IFERROR($E8*F8+($E8*'Basic Price Adjustment'!$E33),\"\"))","v":40.479999999999997},{"$f":"IF(AND($E8>0,F8=0),\"Incomplete\",\"\")","v":""},{"$f":"IFERROR(VLOOKUP(L$3,Data!$B$4:$AE$137,7,0),\"\")","v":62.32},{"$f":"IFERROR(J8*$E8,\"\")","v":62.32},{"$f":"IF(K8=0,0,IFERROR($E8*J8+($E8*'Basic Price Adjustment'!$E33),\"\"))","v":37.299999999999997},{"$f":"IF(AND($E8>0,J8=0),\"Incomplete\",\"\")","v":""},{"$f":"IFERROR(VLOOKUP(P$3,Data!$B$4:$AE$137,7,0),\"\")","v":63.5},{"$f":"IFERROR(N8*$E8,\"\")","v":63.5},{"$f":"IF(O8=0,0,IFERROR($E8*N8+($E8*'Basic Price Adjustment'!$E33),\"\"))","v":38.479999999999997},{"$f":"IF(AND($E8>0,N8=0),\"Incomplete\",\"\")","v":""},{"$f":"IFERROR(VLOOKUP(T$3,Data!$B$4:$AE$137,7,0),\"\")","v":66.2},{"$f":"IFERROR(R8*$E8,\"\")","v":66.2},{"$f":"IF(S8=0,0,IFERROR($E8*R8+($E8*'Basic Price Adjustment'!$E33),\"\"))","v":41.18},{"$f":"IF(AND($E8>0,R8=0),\"Incomplete\",\"\")","v":""},{"$f":"IFERROR(VLOOKUP(X$3,Data!$B$4:$AE$137,7,0),\"\")","v":63.5},{"$f":"IFERROR(V8*$E8,\"\")","v":63.5},{"$f":"IF(W8=0,0,IFERROR($E8*V8+($E8*'Basic Price Adjustment'!$E33),\"\"))","v":38.479999999999997},{"$f":"IF(AND($E8>0,V8=0),\"Incomplete\",\"\")","v":""},{"$f":"IFERROR(VLOOKUP(AB$3,Data!$B$4:$AE$137,7,0),\"\")","v":63.5},{"$f":"IFERROR(Z8*$E8,\"\")","v":63.5},{"$f":"IF(AA8=0,0,IFERROR($E8*Z8+($E8*'Basic Price Adjustment'!$E33),\"\"))","v":38.479999999999997},{"$f":"IF(AND($E8>0,Z8=0),\"Incomplete\",\"\")","v":""},{"$f":"IFERROR(VLOOKUP(AF$3,Data!$B$4:$AE$137,7,0),\"\")","v":63.28},{"$f":"IFERROR(AD8*$E8,\"\")","v":63.28},{"$f":"IF(AE8=0,0,IFERROR($E8*AD8+($E8*'Basic Price Adjustment'!$E33),\"\"))","v":38.26},{"$f":"IF(AND($E8>0,AD8=0),\"Incomplete\",\"\")","v":""},{"$f":"IFERROR(VLOOKUP(AJ$3,Data!$B$4:$AE$137,7,0),\"\")","v":68.95},{"$f":"IFERROR(AH8*$E8,\"\")","v":68.95},{"$f":"IF(AI8=0,0,IFERROR($E8*AH8+($E8*'Basic Price Adjustment'!$E33),\"\"))","v":43.93},{"$f":"IF(AND($E8>0,AH8=0),\"Incomplete\",\"\")","v":""},{"$f":"IFERROR(VLOOKUP(AN$3,Data!$B$4:$AE$137,7,0),\"\")","v":69.64},{"$f":"IFERROR(AL8*$E8,\"\")","v":69.64},{"$f":"IF(AM8=0,0,IFERROR($E8*AL8+($E8*'Basic Price Adjustment'!$E33),\"\"))","v":44.62},{"$f":"IF(AND($E8>0,AL8=0),\"Incomplete\",\"\")","v":""},{"$f":"IFERROR(VLOOKUP(AR$3,Data!$B$4:$AE$137,7,0),\"\")","v":69.5},{"$f":"IFERROR(AP8*$E8,\"\")","v":69.5},{"$f":"IF(AQ8=0,0,IFERROR($E8*AP8+($E8*'Basic Price Adjustment'!$E33),\"\"))","v":44.48},{"$f":"IF(AND($E8>0,AP8=0),\"Incomplete\",\"\")","v":""},{"$f":"IFERROR(VLOOKUP(AV$3,Data!$B$4:$AE$137,7,0),\"\")","v":0},{"$f":"IFERROR(AT8*$E8,\"\")","v":0},{"$f":"IF(AU8=0,0,IFERROR($E8*AT8+($E8*'Basic Price Adjustment'!$E33),\"\"))","v":0},{"$f":"IF(AND($E8>0,AT8=0),\"Incomplete\",\"\")","v":"Incomplete"},{"$f":"IFERROR(VLOOKUP(AZ$3,Data!$B$4:$AE$137,7,0),\"\")","v":80},{"$f":"IFERROR(AX8*$E8,\"\")","v":80},{"$f":"IF(AY8=0,0,IFERROR($E8*AX8+($E8*'Basic Price Adjustment'!$E33),\"\"))","v":54.98},{"$f":"IF(AND($E8>0,AX8=0),\"Incomplete\",\"\")","v":""},{"$f":"IFERROR(VLOOKUP(BD$3,Data!$B$4:$AE$137,7,0),\"\")","v":56.5},{"$f":"IFERROR(BB8*$E8,\"\")","v":56.5},{"$f":"IF(BC8=0,0,IFERROR($E8*BB8+($E8*'Basic Price Adjustment'!$E33),\"\"))","v":31.479999999999997},{"$f":"IF(AND($E8>0,BB8=0),\"Incomplete\",\"\")","v":""},{"$f":"IFERROR(VLOOKUP(BH$3,Data!$B$4:$AE$137,7,0),\"\")","v":70},{"$f":"IFERROR(BF8*$E8,\"\")","v":70},{"$f":"IF(BG8=0,0,IFERROR($E8*BF8+($E8*'Basic Price Adjustment'!$E33),\"\"))","v":44.98},{"$f":"IF(AND($E8>0,BF8=0),\"Incomplete\",\"\")","v":""},{"$f":"IFERROR(VLOOKUP(BL$3,Data!$B$4:$AE$137,7,0),\"\")","v":70},{"$f":"IFERROR(BJ8*$E8,\"\")","v":70},{"$f":"IF(BK8=0,0,IFERROR($E8*BJ8+($E8*'Basic Price Adjustment'!$E33),\"\"))","v":44.98},{"$f":"IF(AND($E8>0,BJ8=0),\"Incomplete\",\"\")","v":""},{"$f":"IFERROR(VLOOKUP(BP$3,Data!$B$4:$AE$137,7,0),\"\")","v":71.5},{"$f":"IFERROR(BN8*$E8,\"\")","v":71.5},{"$f":"IF(BO8=0,0,IFERROR($E8*BN8+($E8*'Basic Price Adjustment'!$E33),\"\"))","v":46.48},{"$f":"IF(AND($E8>0,BN8=0),\"Incomplete\",\"\")","v":""},{"$f":"IFERROR(VLOOKUP(BT$3,Data!$B$4:$AE$137,7,0),\"\")","v":""},{"$f":"IFERROR(BR8*$E8,\"\")","v":""},{"$f":"IF(BS8=0,0,IFERROR($E8*BR8+($E8*'Basic Price Adjustment'!$E33),\"\"))","v":""},{"$f":"IF(AND($E8>0,BR8=0),\"Incomplete\",\"\")","v":""},{"$f":"IFERROR(VLOOKUP(BX$3,Data!$B$4:$AE$137,7,0),\"\")","v":""},{"$f":"IFERROR(BV8*$E8,\"\")","v":""},{"$f":"IF(BW8=0,0,IFERROR($E8*BV8+($E8*'Basic Price Adjustment'!$E33),\"\"))","v":""},{"$f":"IF(AND($E8>0,BV8=0),\"Incomplete\",\"\")","v":""},null,null,{"$f":"H$6","v":40.479999999999997},{"$f":"H$3","v":501}]
{"$rows_left_out":25}
{"sheet":"Order Summary","index":6,"n_rows":34,"n_cols":11,"rows_kept":34,"cut":false,"hidden":false,"merged":[[7,1,7,2],[4,7,4,10],[7,7,7,8],[3,7,3,10],[6,1,6,2],[3,1,3,2]]}
["Manual Override Selection:"]
["Override",{"$f":"IF(D1=\"\",\"No\",\"Yes\")","v":"No"}]
[]
["Agency Release No.",{"$f":"'Order Details'!B19","v":0},null,null,null,null,"Vendor:",{"$f":"IF(D1=\"\",'Vendor Totals'!C2,HLOOKUP(D1,'Vendor Totals'!F2:BX5,3,FALSE))","v":"C WILLIAM HETZER INC"}]
["Project Type:",{"$f":"'Order Details'!B17","v":0},null,null,null,null,null,{"$f":"IF(D1=\"\",'Vendor Totals'!C3,HLOOKUP('Order Summary'!$D$1,'Vendor Totals'!$F$2:$BX$5,4,0))","v":"10104 Mapleville Road\nHagerstown, MD 21740"}]
["Description:",{"$f":"'Order Details'!B18","v":0},null,null,null,null,"PID",{"$f":"IF(D1=\"\",'Vendor Totals'!B3,HLOOKUP('Order Summary'!D1,'Vendor Totals'!F2:BX5,2,FALSE))","v":513}]
["Project #",{"$f":"'Order Details'!B20","v":0}]
["Authorization #",{"$f":"'Order Details'!B21","v":0},null,null,null,null,"TOTAL",{"$f":"SUM(K11:K34)","v":31.479999999999997}]
{"$rows_left_out":27}
{"sheet":"PJ-101","index":7,"n_rows":62,"n_cols":10,"rows_kept":62,"cut":false,"hidden":false,"merged":[[49,1,49,8],[50,1,50,8],[51,1,51,8],[52,1,52,8],[53,1,53,8],[13,2,13,3],[32,4,32,6],[27,3,27,5],[44,3,44,4],[39,1,39,8],[40,1,40,8],[22,0,22,2],[22,7,22,8],[57,3,57,4],[60,1,60,2],[60,3,60,6],[61,3,61,6],[54,1,54,10]]}
["STATE  USE  ONLY"]
["PJ-101"]
["Rev. 4/14/82"]
[]
["WEST  VIRGINIA  DEPARTMENT  OF HIGHWAYS"]
[]
["REPORT  OF  ROAD  OR  BRIDGE  PROJECTS  EFFECTING  PLANNING  INVENTORY  DATA"]
["(Send  to  RP  to  update  Straight-Line  Diagrams)"]
{"$rows_left_out":55}
{"sheet":"FIELD","index":8,"n_rows":39,"n_cols":13,"rows_kept":39,"cut":false,"hidden":false,"merged":[[37,8,37,12],[38,8,38,12],[35,8,35,12],[36,8,36,12],[11,7,12,12],[13,8,13,12],[23,8,23,12],[24,8,24,12],[19,8,19,12],[20,8,20,12],[21,8,21,12],[22,8,22,12],[14,8,14,12],[15,8,15,12],[16,8,16,12],[17,8,17,12],[0,0,0,12],[1,7,1,12],[2,8,2,9],[3,8,3,9],[4,8,4,9],[2,10,2,12],[1,0,1,2],[3,0,3,2],[4,0,4,2],[1,3,1,4],[3,3,3,4],[1,5,1,6],[2,5,2,6],[2,0,2,2],[2,3,2,4],[7,0,10,2],[3,10,3,12],[4,10,4,12],[5,8,5,9],[6,8,6,9],[5,10,5,12],[5,0,5,2],[6,0,6,2],[7,3,10,12],[3,5,3,6],[4,5,4,6],[5,3,5,7],[6,3,6,7],[4,3,4,4],[11,0,11,2],[12,0,12,2],[13,0,13,2],[11,3,11,5],[12,3,12,5],[33,8,33,12],[34,8,34,12],[14,5,14,6],[14,0,14,2],[32,8,32,12],[31,8,31,12],[30,8,30,12],[25,8,25,12],[26,8,26,12],[27,8,27,12],[28,8,28,12],[29,8,29,12],[18,8,18,12]]}
["HOT-MIXED ASPHALT PROJECT DATA (FOR FIELD PERSONNEL, BOTH STATE & CONTRACTOR)"]
["Project Title:",null,null,{"$f":"'Order Details'!B17","v":0},null,"Project Description:",null,{"$f":"'Order Details'!B18","v":0}]
["Project Number:",null,null,{"$f":"'Order Details'!B20","v":0},null,"Longitude:",null,null,"Agency Release No.",null,{"$f":"IF('Order Details'!$B19=\"\",\"\",'Order Details'!$B19)","v":""}]
["County:",null,null,{"$f":"'Order Details'!$B$3","v":"Berkeley"},null,"Latitude:",null,null,"Prepared By:"]
["Auth. No.:",null,null,{"$f":"'Order Details'!B21","v":0},null,"Date:",null,{"$f":"TODAY()","v":"2024-02-05"},"Length (miles):",null,{"$f":"'Order Details'!B24","v":0}]
["Begin:",null,null,{"$f":"'Order Details'!$B$16","v":0},null,null,null,null,"Route Sign:",null,{"$f":"'Order Details'!$B$6","v":0}]
["End:",null,null,{"$f":"'Order Details'!$B$17","v":0},null,null,null,null,"Route No.:",null,{"$f":"'Order Details'!B7","v":0},{"$f":"\"/\"","v":"/"},{"$f":"IF('Order Details'!$B$8=\"\",\"\",'Order Details'!$B$8)","v":""}]
["Further Description:\nand \nComments:"]
{"$rows_left_out":31}